Target
Beta-secretase 1
Ligand
BDBM50320618
Substrate
Meas. Tech.
ChEMBL_638726 (CHEMBL1169087)
IC50
11900±n/a nM
Citation
 Al-Nadaf, AAbu Sheikha, GTaha, MO Elaborate ligand-based pharmacophore exploration and QSAR analysis guide the synthesis of novel pyridinium-based potent beta-secretase inhibitory leads. Bioorg Med Chem 18:3088-115 (2010)  
Target
Name:
Beta-secretase 1
Synonyms:
ASP2 Aspartyl protease 2 BACE1 Beta-secretase (BACE) Beta-secretase 1 (BACE 1) Beta-secretase 1 (BACE1) Beta-site amyloid precursor protein cleaving enzyme 1 Memapsin-2 beta-Secretase (BACE-1) | beta-Secretase (BACE1)
Type:
Protein
Mol. Mass.:
55755.10
Organism:
Homo sapiens (Human)
Description:
P56817
Residue:
501
  
Inhibitor
Name:
BDBM50320618
Synonyms:
4-ethoxy-6-(2-(4-iodo-2-methylphenyl)hydrazinyl)-N-(2-morpholinoethyl)-1,3,5-triazin-2-amine | CHEMBL1163705
Type:
Small organic molecule
Emp. Form.:
C18H26IN7O2
Mol. Mass.:
499.3492
SMILES:
CCOc1nc(NCCN2CCOCC2)nc(NNc2ccc(I)cc2C)n1
: