Target
Aldo-keto reductase family 1 member A1
Ligand
BDBM16452
Substrate
Meas. Tech.
ChEMBL_640041 (CHEMBL1174255)
IC50
2700±n/a nM
Citation
 Endo, SMatsunaga, TKuwata, KZhao, HTEl-Kabbani, OKitade, YHara, A Chromene-3-carboxamide derivatives discovered from virtual screening as potent inhibitors of the tumour maker, AKR1B10. Bioorg Med Chem 18:2485-90 (2010)  
Target
Name:
Aldo-keto reductase family 1 member A1
Synonyms:
AK1A1_HUMAN ALDR1 Alcohol dehydrogenase [NADP+] Aldehyde reductase | Aldo-keto reductase family 1 member A1
Type:
Enzyme
Mol. Mass.:
36574.11
Organism:
Homo sapiens (Human)
Description:
Residue:
325
  
Inhibitor
Name:
BDBM16452
Synonyms:
(4-oxo-3-{[5-(trifluoromethyl)-1,3-benzothiazol-2-yl]methyl}-3,4-dihydrophthalazin-1-yl)acetic acid Alond Xedia | Zopolrestat
Type:
Small organic molecule
Emp. Form.:
C19H12F3N3O3S
Mol. Mass.:
419.377
SMILES:
OC(=O)Cc1nn(Cc2nc3cc(ccc3s2)C(F)(F)F)c(=O)c2ccccc12
: