Target
Tyrosine-protein kinase ABL1
Ligand
BDBM50322544
Substrate
Meas. Tech.
ChEMBL_641693 (CHEMBL1176860)
IC50
9±n/a nM
Citation
 Huang, WSMetcalf, CASundaramoorthi, RWang, YZou, DThomas, RMZhu, XCai, LWen, DLiu, SRomero, JQi, JChen, IBanda, GLentini, SPDas, SXu, QKeats, JWang, FWardwell, SNing, YSnodgrass, JTBroudy, MIRussian, KZhou, TCommodore, LNarasimhan, NIMohemmad, QKIuliucci, JRivera, VMDalgarno, DCSawyer, TKClackson, TShakespeare, WC Discovery of 3-[2-(imidazo[1,2-b]pyridazin-3-yl)ethynyl]-4-methyl-N-{4-[(4-methylpiperazin-1-yl)methyl]-3-(trifluoromethyl)phenyl}benzamide (AP24534), a potent, orally active pan-inhibitor of breakpoint cluster region-abelson (BCR-ABL) kinase including the T315I gatekeeper mutant. J Med Chem 53:4701-19 (2010)  
Target
Name:
Tyrosine-protein kinase ABL1
Synonyms:
ABL ABL1_HUMAN JTK7 Proto-oncogene tyrosine-protein kinase ABL1 Tyrosine-protein kinase ABL V-abl Abelson murine leukemia viral oncogene homolog 1 p150 | tyrosine-protein kinase ABL1 isoform a
Type:
Enzyme
Mol. Mass.:
122897.30
Organism:
Homo sapiens (Human)
Description:
P00519
Residue:
1130
  
Inhibitor
Name:
BDBM50322544
Synonyms:
CHEMBL1171281 | N-{3-[2-(Imidazo[1,2-a]pyridin-3-yl)ethynyl]-4-methylphenyl}-4-[(4-methyl-1-piperazinyl)methyl]-3-(trifluoromethyl)benzamide
Type:
Small organic molecule
Emp. Form.:
C30H28F3N5O
Mol. Mass.:
531.5714
SMILES:
CN1CCN(Cc2ccc(cc2C(F)(F)F)C(=O)Nc2ccc(C)c(c2)C#Cc2cnc3ccccn23)CC1
: