Target
Cruzipain
Ligand
BDBM50322737
Substrate
Meas. Tech.
ChEMBL_642347 (CHEMBL1177373)
Ki
70±n/a nM
Citation
 Ferreira, RSSimeonov, AJadhav, AEidam, OMott, BTKeiser, MJMcKerrow, JHMaloney, DJIrwin, JJShoichet, BK Complementarity between a docking and a high-throughput screen in discovering new cruzain inhibitors. J Med Chem 53:4891-905 (2010)  
Target
Name:
Cruzipain
Synonyms:
CYSP_TRYCR Cruzaine | Major cysteine proteinase
Type:
Protein
Mol. Mass.:
49831.41
Organism:
Trypanosoma cruzi
Description:
P25779
Residue:
467
  
Inhibitor
Name:
BDBM50322737
Synonyms:
2-(2-chloro-5-(trifluoromethyl)phenylamino)-2-oxo-1-phenylethyl 2-benzamidoacetate | CHEMBL1173672
Type:
Small organic molecule
Emp. Form.:
C24H18ClF3N2O4
Mol. Mass.:
490.859
SMILES:
FC(F)(F)c1ccc(Cl)c(NC(=O)C(OC(=O)CNC(=O)c2ccccc2)c2ccccc2)c1
: