Target
Cytochrome P450 1A2
Ligand
BDBM50322853
Substrate
Meas. Tech.
ChEMBL_644639 (CHEMBL1211618)
IC50
>10000±n/a nM
Citation
 Micheli, FAndreotti, DBraggio, SChecchia, A A specific and direct comparison of the trifluoromethyl and pentafluoro sulfanyl groups on the selective dopamine D(3) antagonist 3-(3-{[4-methyl-5-(4-methyl-1,3-oxazol-5-yl)-4H-1,2,4-triazol-3-yl]thio}propyl)-1-phenyl-3-azabicyclo[3.1.0]hexane template. Bioorg Med Chem Lett 20:4566-8 (2010)  
Target
Name:
Cytochrome P450 1A2
Synonyms:
CP1A2_HUMAN CYPIA2 Cytochrome P(3)450 Cytochrome P450 1A2 (CYP1A2) Cytochrome P450-P3
Type:
Enzyme
Mol. Mass.:
58423.38
Organism:
Homo sapiens (Human)
Description:
P05177
Residue:
516
  
Inhibitor
Name:
BDBM50322853
Synonyms:
(1R,5S/1S,5R)-3-(3-{[4-Methyl-5-(4-methyl-1,3-oxazol-5-yl)-4H-1,2,4-triazol-3-yl]thio}propyl)-1-[3-(trifluoromethyl)phenyl]-3-azabicyclo[3.1.0]hexane CHEMBL1081957 | rac-4-methyl-5-(4-methyl-5-(3-(1-(3-(trifluoromethyl)phenyl)-3-azabicyclo[3.1.0]hexan-3-yl)propylthio)-4H-1,2,4-triazol-3-yl)oxazole
Type:
Small organic molecule
Emp. Form.:
C22H24F3N5OS
Mol. Mass.:
463.519
SMILES:
Cc1ncoc1-c1nnc(SCCCN2CC3CC3(C2)c2cccc(c2)C(F)(F)F)n1C
: