Target
Cytochrome P450 2D6
Ligand
BDBM50312271
Substrate
Meas. Tech.
ChEMBL_644642 (CHEMBL1211621)
IC50
>10000±n/a nM
Citation
 Micheli, FAndreotti, DBraggio, SChecchia, A A specific and direct comparison of the trifluoromethyl and pentafluoro sulfanyl groups on the selective dopamine D(3) antagonist 3-(3-{[4-methyl-5-(4-methyl-1,3-oxazol-5-yl)-4H-1,2,4-triazol-3-yl]thio}propyl)-1-phenyl-3-azabicyclo[3.1.0]hexane template. Bioorg Med Chem Lett 20:4566-8 (2010)  
Target
Name:
Cytochrome P450 2D6
Synonyms:
CP2D6_HUMAN CYP2DL1 Cytochrome P450 2D6 (CYP2D6) P450-DB1
Type:
Protein
Mol. Mass.:
55774.82
Organism:
Homo sapiens (Human)
Description:
P10635
Residue:
497
  
Inhibitor
Name:
BDBM50312271
Synonyms:
(1S,5R)-3-(3-{[4-Methyl-5-(4-methyl-1,3-oxazol-5-yl)-4H-1,2,4-triazol-3-yl]thio}propyl)-1-[4-(trifluoromethyl)phenyl]-3-azabicyclo[3.1.0]hexane | CHEMBL1081409
Type:
Small organic molecule
Emp. Form.:
C22H24F3N5OS
Mol. Mass.:
463.519
SMILES:
Cc1ncoc1-c1nnc(SCCCN2C[C@@H]3C[C@@]3(C2)c2ccc(cc2)C(F)(F)F)n1C
: