Target
Cytochrome P450 2D6
Ligand
BDBM50322854
Substrate
Meas. Tech.
ChEMBL_644642 (CHEMBL1211621)
IC50
5000±n/a nM
Citation
 Micheli, FAndreotti, DBraggio, SChecchia, A A specific and direct comparison of the trifluoromethyl and pentafluoro sulfanyl groups on the selective dopamine D(3) antagonist 3-(3-{[4-methyl-5-(4-methyl-1,3-oxazol-5-yl)-4H-1,2,4-triazol-3-yl]thio}propyl)-1-phenyl-3-azabicyclo[3.1.0]hexane template. Bioorg Med Chem Lett 20:4566-8 (2010)  
Target
Name:
Cytochrome P450 2D6
Synonyms:
CP2D6_HUMAN CYP2DL1 Cytochrome P450 2D6 (CYP2D6) P450-DB1
Type:
Protein
Mol. Mass.:
55774.82
Organism:
Homo sapiens (Human)
Description:
P10635
Residue:
497
  
Inhibitor
Name:
BDBM50322854
Synonyms:
CHEMBL1210614
Type:
Small organic molecule
Emp. Form.:
C21H24F5N5OS2
Mol. Mass.:
521.57
SMILES:
Cc1ncoc1-c1nnc(SCCCN2CC3CC3(C2)c2cccc(c2)S(F)(F)(F)(F)F)n1C
: