Target
Cytochrome P450 3A4
Ligand
BDBM50322852
Substrate
Meas. Tech.
ChEMBL_644644 (CHEMBL1211623)
IC50
>10000±n/a nM
Citation
 Micheli, FAndreotti, DBraggio, SChecchia, A A specific and direct comparison of the trifluoromethyl and pentafluoro sulfanyl groups on the selective dopamine D(3) antagonist 3-(3-{[4-methyl-5-(4-methyl-1,3-oxazol-5-yl)-4H-1,2,4-triazol-3-yl]thio}propyl)-1-phenyl-3-azabicyclo[3.1.0]hexane template. Bioorg Med Chem Lett 20:4566-8 (2010)  
Target
Name:
Cytochrome P450 3A4
Synonyms:
Albendazole monooxygenase CP3A4_HUMAN CYP3A4 CYPIIIA4 Cytochrome P450 3A4 (CYP3A4) Nifedipine oxidase Taurochenodeoxycholate 6-alpha-hydroxylase
Type:
Enzyme
Mol. Mass.:
57349.57
Organism:
Homo sapiens (Human)
Description:
Residue:
503
  
Inhibitor
Name:
BDBM50322852
Synonyms:
CHEMBL1210552
Type:
Small organic molecule
Emp. Form.:
C21H24F5N5OS2
Mol. Mass.:
521.57
SMILES:
Cc1ncoc1-c1nnc(SCCCN2CC3CC3(C2)c2ccc(cc2)S(F)(F)(F)(F)F)n1C
: