Target
Potassium voltage-gated channel subfamily H member 2
Ligand
BDBM50322852
Substrate
Meas. Tech.
ChEMBL_644636 (CHEMBL1211615)
IC50
501.19±n/a nM
Citation
 Micheli, FAndreotti, DBraggio, SChecchia, A A specific and direct comparison of the trifluoromethyl and pentafluoro sulfanyl groups on the selective dopamine D(3) antagonist 3-(3-{[4-methyl-5-(4-methyl-1,3-oxazol-5-yl)-4H-1,2,4-triazol-3-yl]thio}propyl)-1-phenyl-3-azabicyclo[3.1.0]hexane template. Bioorg Med Chem Lett 20:4566-8 (2010)  
Target
Name:
Potassium voltage-gated channel subfamily H member 2
Synonyms:
1,3-beta-glucan synthase component GLS2 ERG Eag-related protein 1 Ether-a-go-go-related gene (HERG) Ether-a-go-go-related gene potassium channel 1 Ether-a-go-go-related gene potassium channel 1 (hERG1) Ether-a-go-go-related protein 1 H-ERG KCNH2 Potassium voltage-gated channel subfamily H member 2 (hERG) Voltage-gated potassium channel subunit Kv11.1 hERG Potassium Channel 1 | putative potassium channel subunit
Type:
Multi-pass membrane protein
Mol. Mass.:
126672.65
Organism:
Homo sapiens (Human)
Description:
Q12809
Residue:
1159
  
Inhibitor
Name:
BDBM50322852
Synonyms:
CHEMBL1210552
Type:
Small organic molecule
Emp. Form.:
C21H24F5N5OS2
Mol. Mass.:
521.57
SMILES:
Cc1ncoc1-c1nnc(SCCCN2CC3CC3(C2)c2ccc(cc2)S(F)(F)(F)(F)F)n1C
: