Target
Mitogen-activated protein kinase 14
Ligand
BDBM50323425
Substrate
Meas. Tech.
ChEMBL_644073 (CHEMBL1211972)
IC50
296±n/a nM
Citation
 Liu, HKuhn, CFeru, FJacques, SLDeshmukh, GDYe, PRennie, GRJohnson, TKazmirski, SLow, SColi, RDing, YHCheng, ACTecle, HEnglish, JMStanton, RWu, JC Enhanced selectivity profile of pyrazole-urea based DFG-out p38alpha inhibitors. Bioorg Med Chem Lett 20:4885-91 (2010)  
Target
Name:
Mitogen-activated protein kinase 14
Synonyms:
CSAID-binding protein CSBP1 CSPB1 MAP kinase 14 MAP kinase p38 alpha MAPK14 MK14_HUMAN Mitogen-activated protein kinase p38 alpha Stress-activated protein kinase 2a | p38 MAP kinase alpha/beta
Type:
Serine/threonine-protein kinase
Mol. Mass.:
41286.76
Organism:
Homo sapiens (Human)
Description:
Q16539
Residue:
360
  
Inhibitor
Name:
BDBM50323425
Synonyms:
CHEMBL1209407 | N-(3-(3-tert-butyl-5-(3-phenylureido)-1H-pyrazol-1-yl)benzyl)-2-(2-oxopyrrolidin-1-yl)acetamide
Type:
Small organic molecule
Emp. Form.:
C27H32N6O3
Mol. Mass.:
488.5814
SMILES:
CC(C)(C)c1cc(NC(=O)Nc2ccccc2)n(n1)-c1cccc(CNC(=O)CN2CCCC2=O)c1
: