Target
Dynamin-1
Ligand
BDBM50323461
Substrate
Meas. Tech.
ChEMBL_644134 (CHEMBL1212033)
IC50
5100±n/a nM
Citation
 Lee, SJung, KYPark, JCho, JHKim, YCChang, S Synthesis of potent chemical inhibitors of dynamin GTPase. Bioorg Med Chem Lett 20:4858-64 (2010)  
Target
Name:
Dynamin-1
Synonyms:
DNM DYN1_HUMAN | Dynamin-1
Type:
PROTEIN
Mol. Mass.:
97411.67
Organism:
Homo sapiens (Human)
Description:
ChEMBL_1458576
Residue:
864
  
Inhibitor
Name:
BDBM50323461
Synonyms:
CHEMBL1208862 | N'-(3,4-dihydroxybenzylidene)-2-naphthohydrazide
Type:
Small organic molecule
Emp. Form.:
C18H14N2O3
Mol. Mass.:
306.3154
SMILES:
Oc1ccc(\C=N\NC(=O)c2ccc3ccccc3c2)cc1O
: