Target
Carbonic anhydrase 2
Ligand
BDBM50323741
Substrate
Meas. Tech.
ChEMBL_646954 (CHEMBL1217095)
Ki
11000±n/a nM
Citation
 Carta, FTemperini, CInnocenti, AScozzafava, AKaila, KSupuran, CT Polyamines inhibit carbonic anhydrases by anchoring to the zinc-coordinated water molecule. J Med Chem 53:5511-22 (2010)  
Target
Name:
Carbonic anhydrase 2
Synonyms:
CA-II CAC Carbonate dehydratase II Carbonic anhydrase 2 (CA-II) Carbonic anhydrase C Carbonic anhydrase II (CA-II) Carbonic anhydrase II (hCA II) | Carbonic anhydrase isoenzyme II (hCA II)
Type:
Enzyme
Mol. Mass.:
29250.71
Organism:
Homo sapiens (Human)
Description:
P00918
Residue:
260
  
Inhibitor
Name:
BDBM50323741
Synonyms:
CHEMBL119296
Type:
Small organic molecule
Emp. Form.:
C5H14N2
Mol. Mass.:
102.1781
SMILES:
NCCCCCN
: