Target
Carbonic anhydrase 9
Ligand
BDBM50323741
Substrate
Meas. Tech.
ChEMBL_646961 (CHEMBL1217102)
Ki
380±n/a nM
Citation
 Carta, FTemperini, CInnocenti, AScozzafava, AKaila, KSupuran, CT Polyamines inhibit carbonic anhydrases by anchoring to the zinc-coordinated water molecule. J Med Chem 53:5511-22 (2010)  
Target
Name:
Carbonic anhydrase 9
Synonyms:
CA-IX CAH9_HUMAN Carbonic anhydrase 9 (CA IX) Carbonic anhydrase 9 precursor Carbonic anhydrase IX (CAIX) Carbonic anhydrases; II & IX MN RCC-associated antigen G250
Type:
Enzyme
Mol. Mass.:
49669.03
Organism:
Homo sapiens (Human)
Description:
Catalytic domain of human cloned isozyme was used in the assay
Residue:
459
  
Inhibitor
Name:
BDBM50323741
Synonyms:
CHEMBL119296
Type:
Small organic molecule
Emp. Form.:
C5H14N2
Mol. Mass.:
102.1781
SMILES:
NCCCCCN
: