Target
Polycystin-2
Ligand
BDBM50324348
Substrate
Meas. Tech.
ChEMBL_650175 (CHEMBL1219873)
IC50
2±n/a nM
Citation
 Meredith, ELBeattie, KBurgis, RCapparelli, MChapo, JDipietro, LGamber, GEnyedy, IHood, DBHosagrahara, VJewell, CKoch, KALee, WLemon, DDMcKinsey, TAMiranda, KPagratis, NPhan, DPlato, CRao, CRozhitskaya, OSoldermann, NSpringer, Cvan Eis, MVega, RBYan, WZhu, QMonovich, LG Identification of potent and selective amidobipyridyl inhibitors of protein kinase D. J Med Chem 53:5422-38 (2010)  
Target
Name:
Polycystin-2
Synonyms:
PKD2 TRPP2
Type:
PROTEIN
Mol. Mass.:
109676.85
Organism:
Homo sapiens (Human)
Description:
ChEMBL_886731
Residue:
968
  
Inhibitor
Name:
BDBM50324348
Synonyms:
6-(piperazin-1-yl)-4-(4H-pyrazol-4-yl)-N-(tetrahydro-2H-pyran-4-yl)-2,4'-bipyridin-2'-amine | CHEMBL1215219
Type:
Small organic molecule
Emp. Form.:
C22H27N7O
Mol. Mass.:
405.4961
SMILES:
C1CN(CCN1)c1cc(cc(n1)-c1ccnc(NC2CCOCC2)c1)-c1cn[nH]c1
: