Target
Polycystin-2
Ligand
BDBM50324336
Substrate
Meas. Tech.
ChEMBL_650175 (CHEMBL1219873)
IC50
540±n/a nM
Citation
 Meredith, ELBeattie, KBurgis, RCapparelli, MChapo, JDipietro, LGamber, GEnyedy, IHood, DBHosagrahara, VJewell, CKoch, KALee, WLemon, DDMcKinsey, TAMiranda, KPagratis, NPhan, DPlato, CRao, CRozhitskaya, OSoldermann, NSpringer, Cvan Eis, MVega, RBYan, WZhu, QMonovich, LG Identification of potent and selective amidobipyridyl inhibitors of protein kinase D. J Med Chem 53:5422-38 (2010)  
Target
Name:
Polycystin-2
Synonyms:
PKD2 TRPP2
Type:
PROTEIN
Mol. Mass.:
109676.85
Organism:
Homo sapiens (Human)
Description:
ChEMBL_886731
Residue:
968
  
Inhibitor
Name:
BDBM50324336
Synonyms:
2'-Cyclohexylamino-6-((S)-pyrrolidin-3-ylamino)[2,4']bipyridinyl-4-carboxylic Acid Amide | CHEMBL1215221
Type:
Small organic molecule
Emp. Form.:
C21H28N6O
Mol. Mass.:
380.4866
SMILES:
NC(=O)c1cc(N[C@H]2CCNC2)nc(c1)-c1ccnc(NC2CCCCC2)c1
: