Target
Monocarboxylate transporter 1
Ligand
BDBM50416571
Substrate
Meas. Tech.
ChEMBL_653482 (CHEMBL1226685)
Ki
3.4±n/a nM
Citation
Target
Name:
Monocarboxylate transporter 1
Synonyms:
MCT 1 MOT1_HUMAN SLC16A1 | Solute carrier family 16 member 1
Type:
PROTEIN
Mol. Mass.:
53956.64
Organism:
Homo sapiens (Human)
Description:
ChEMBL_1451367
Residue:
500
  
Inhibitor
Name:
BDBM50416571
Synonyms:
CHEMBL1221551
Type:
Small organic molecule
Emp. Form.:
C24H24F3N3O3S
Mol. Mass.:
491.526
SMILES:
CC(C)Cn1c2sc(Cc3ccccc3C(F)(F)F)c(C(=O)N3CC=CC3)c2c(=O)n(C)c1=O
: