Target
Monocarboxylate transporter 1
Ligand
BDBM22002
Substrate
Meas. Tech.
ChEMBL_653483 (CHEMBL1226686)
Ki
0.355±n/a nM
Citation
Target
Name:
Monocarboxylate transporter 1
Synonyms:
MCT 1 MOT1_HUMAN SLC16A1 | Solute carrier family 16 member 1
Type:
PROTEIN
Mol. Mass.:
53956.64
Organism:
Homo sapiens (Human)
Description:
ChEMBL_1451367
Residue:
500
  
Inhibitor
Name:
BDBM22002
Synonyms:
5-[(3-hydroxypropyl)sulfanyl]-3-methyl-1-(2-methylpropyl)-6-{[2-(trifluoromethyl)phenyl]methyl}-1H,2H,3H,4H-thieno[2,3-d]pyrimidine-2,4-dione | Thieno[2,3-d]pyrimidine-2,4(1H,3H)-dione, 4
Type:
Small organic molecule
Emp. Form.:
C22H25F3N2O3S2
Mol. Mass.:
486.571
SMILES:
CC(C)Cn1c2sc(Cc3ccccc3C(F)(F)F)c(SCCCO)c2c(=O)n(C)c1=O
: