Target
Beta-secretase 2
Ligand
BDBM50324922
Substrate
Meas. Tech.
ChEMBL_651541 (CHEMBL1227793)
IC50
8000±n/a nM
Citation
 Madden, JDod, JRGodemann, RKraemer, JSmith, MBiniszkiewicz, MHallett, DJBarker, JDyekjaer, JDHesterkamp, T Fragment-based discovery and optimization of BACE1 inhibitors. Bioorg Med Chem Lett 20:5329-33 (2010)  
Target
Name:
Beta-secretase 2
Synonyms:
AEPLC ASP1 Asp 1 Aspartyl protease 1 BACE2_HUMAN Beta-secretase (BACE) Beta-secretase 2 (BACE-2) Beta-site APP-cleaving enzyme 2 Memapsin-1 beta-Secretase (BACE-2)
Type:
Protein
Mol. Mass.:
56171.20
Organism:
Homo sapiens (Human)
Description:
Q9Y5Z0
Residue:
518
  
Inhibitor
Name:
BDBM50324922
Synonyms:
(3S)-3-(2-amino-5-chloro-1H-benzimidazol-1-yl)-N-(cyclohexylmethyl)pentanamide CHEMBL1222240
Type:
Small organic molecule
Emp. Form.:
C19H27ClN4O
Mol. Mass.:
362.897
SMILES:
CC[C@@H](CC(=O)NCC1CCCCC1)n1c(N)nc2cc(Cl)ccc12
: