Target
Extracellular calcium-sensing receptor
Ligand
BDBM50325517
Substrate
Meas. Tech.
ChEMBL_652215 (CHEMBL1228488)
IC50
43±n/a nM
Citation
 Gerspacher, MAltmann, EBeerli, RBuhl, TEndres, RGamse, RKameni-Tcheudji, JKneissel, MKrawinkler, KHMissbach, MSchmidt, ASeuwen, KWeiler, SWidler, L Penta-substituted benzimidazoles as potent antagonists of the calcium-sensing receptor (CaSR-antagonists). Bioorg Med Chem Lett 20:5161-4 (2010)  
Target
Name:
Extracellular calcium-sensing receptor
Synonyms:
CASR CaR Calcium-sensing receptor (CaSR) GPRC2A Parathyroid Cell calcium-sensing receptor Synonyms=GPRC2A | hCasR
Type:
Protein
Mol. Mass.:
120663.13
Organism:
Homo sapiens (Human)
Description:
P41180
Residue:
1078
  
Inhibitor
Name:
BDBM50325517
Synonyms:
4-bromo-5-(3,4-dimethoxybenzyl)-2-(4-isopropylphenyl)-7-methoxy-1-(2-methoxyethyl)-1H-benzo[d]imidazole | CHEMBL1222490
Type:
Small organic molecule
Emp. Form.:
C29H33BrN2O4
Mol. Mass.:
553.487
SMILES:
COCCn1c(nc2c(Br)c(Cc3ccc(OC)c(OC)c3)cc(OC)c12)-c1ccc(cc1)C(C)C
: