Target
Cytochrome P450 1B1
Ligand
BDBM50241084
Substrate
Meas. Tech.
ChEMBL_652515 (CHEMBL1225718)
IC50
20±n/a nM
Citation
 Takemura, HItoh, TYamamoto, KSakakibara, HShimoi, K Selective inhibition of methoxyflavonoids on human CYP1B1 activity. Bioorg Med Chem 18:6310-5 (2010)  
Target
Name:
Cytochrome P450 1B1
Synonyms:
CP1B1_HUMAN CYPIB1 | Cytochrome P450 1B1 (CYP1B1)
Type:
PROTEIN
Mol. Mass.:
60861.81
Organism:
Homo sapiens (Human)
Description:
ChEMBL_1474523
Residue:
543
  
Inhibitor
Name:
BDBM50241084
Synonyms:
3'-Methoxyapigenin 5,7-dihydroxy-2-(4-hydroxy-3-methoxyphenyl)-4-benzopyrone 5,7-dihydroxy-2-(4-hydroxy-3-methoxyphenyl)-4H-chromen-4-one Chryseriol Chrysoeriol (26) cid_5280666
Type:
Small organic molecule
Emp. Form.:
C16H12O6
Mol. Mass.:
300.2629
SMILES:
COc1cc(ccc1O)-c1cc(=O)c2c(O)cc(O)cc2o1
: