Target
cAMP-specific 3',5'-cyclic phosphodiesterase 4C
Ligand
BDBM50325794
Substrate
Meas. Tech.
ChEMBL_652842 (CHEMBL1226045)
IC50
414±n/a nM
Citation
 Aspiotis, RDeschênes, DDubé, DGirard, YHuang, ZLaliberté, FLiu, SPapp, RNicholson, DWYoung, RN The discovery and synthesis of highly potent subtype selective phosphodiesterase 4D inhibitors. Bioorg Med Chem Lett 20:5502-5 (2010)  
Target
Name:
cAMP-specific 3',5'-cyclic phosphodiesterase 4C
Synonyms:
3',5'-cyclic phosphodiesterase NP_000914.2 PDE4C | PDE4C1
Type:
Enzyme Catalytic Domain
Mol. Mass.:
79875.54
Organism:
Homo sapiens (Human)
Description:
Q08493
Residue:
712
  
Inhibitor
Name:
BDBM50325794
Synonyms:
3-(4-((8-(3-methoxyphenyl)quinolin-6-yl)methoxy)phenyl)propanenitrile | CHEMBL1224721
Type:
Small organic molecule
Emp. Form.:
C26H22N2O2
Mol. Mass.:
394.4651
SMILES:
COc1cccc(c1)-c1cc(COc2ccc(CCC#N)cc2)cc2cccnc12
: