Target
Vasopressin V2 receptor
Ligand
BDBM50325847
Substrate
Meas. Tech.
ChEMBL_652650 (CHEMBL1225853)
IC50
>100000±n/a nM
Citation
 Letourneau, JJRiviello, CMLi, HCole, AGHo, KKZanetakos, HADesai, HZhao, JAuld, DSNapier, SEThomson, FJGoan, KAMorphy, JROhlmeyer, MHWebb, ML Identification and optimization of novel 2-(4-oxo-2-aryl-quinazolin-3(4H)-yl)acetamide vasopressin V3 (V1b) receptor antagonists. Bioorg Med Chem Lett 20:5394-7 (2010)  
Target
Name:
Vasopressin V2 receptor
Synonyms:
ADHR AVPR2 DIR Renal-type arginine vasopressin receptor V2R_HUMAN Vasopressin V2 receptor | Vasopressin receptor
Type:
Receptor
Mol. Mass.:
40295.28
Organism:
Homo sapiens (Human)
Description:
P30518
Residue:
371
  
Inhibitor
Name:
BDBM50325847
Synonyms:
CHEMBL1223814 | N-(cyclopropylmethyl)-2-(6-(3-morpholinopropoxy)-4-oxo-2-phenylquinazolin-3(4H)-yl)acetamide
Type:
Small organic molecule
Emp. Form.:
C27H32N4O4
Mol. Mass.:
476.5674
SMILES:
O=C(Cn1c(nc2ccc(OCCCN3CCOCC3)cc2c1=O)-c1ccccc1)NCC1CC1
: