Target
cAMP-dependent protein kinase catalytic subunit PRKX
Ligand
BDBM50300690
Substrate
Meas. Tech.
ChEMBL_655902 (CHEMBL1244946)
Kd
>10000±n/a nM
Citation
 Zarrinkar, PPGunawardane, RNCramer, MDGardner, MFBrigham, DBelli, BKaraman, MWPratz, KWPallares, GChao, QSprankle, KGPatel, HKLevis, MArmstrong, RCJames, JBhagwat, SS AC220 is a uniquely potent and selective inhibitor of FLT3 for the treatment of acute myeloid leukemia (AML). Blood 114:2984-92 (2009)  
Target
Name:
cAMP-dependent protein kinase catalytic subunit PRKX
Synonyms:
PKX1 PRKX_HUMAN | Serine/threonine-protein kinase PRKX
Type:
Enzyme Catalytic Domain
Mol. Mass.:
40897.91
Organism:
Homo sapiens (Human)
Description:
gi_4826948
Residue:
358
  
Inhibitor
Name:
BDBM50300690
Synonyms:
1-(5-Tert-Butyl-1,2-Oxazol-3-Yl)-3-(4-{7-[2-(Morpholin-4-Yl)ethoxy]imidazo[2,1-B][1,3]benzothiazol-2-Yl}phenyl)urea AC 220 AC010220 ASP-2689 N-(5-tert-Butyl-isoxazol-3-yl)-N'-{4-[7-(2-morpholin-4-yl-ethoxy)imidazo[2,1-b][1,3]benzothiazol-2-yl]phenyl}urea Quizartinib (AC220) US11542261, Compound quizartinib | US9216997, Quizartinib (positive compound)
Type:
Small organic molecule
Emp. Form.:
C29H32N6O4S
Mol. Mass.:
560.667
SMILES:
CC(C)(C)c1cc(NC(=O)Nc2ccc(cc2)-c2cn3c(n2)sc2cc(OCCN4CCOCC4)ccc32)no1
: