Target
Mitogen-activated protein kinase kinase kinase 9
Ligand
BDBM4814
Substrate
Meas. Tech.
ChEMBL_655475 (CHEMBL1244519)
Kd
3400±n/a nM
Citation
 Zarrinkar, PPGunawardane, RNCramer, MDGardner, MFBrigham, DBelli, BKaraman, MWPratz, KWPallares, GChao, QSprankle, KGPatel, HKLevis, MArmstrong, RCJames, JBhagwat, SS AC220 is a uniquely potent and selective inhibitor of FLT3 for the treatment of acute myeloid leukemia (AML). Blood 114:2984-92 (2009)  
Target
Name:
Mitogen-activated protein kinase kinase kinase 9
Synonyms:
M3K9_HUMAN MLK1 Mitogen-activated protein kinase kinase kinase 9 (MLK1) PRKE1
Type:
protein
Mol. Mass.:
121881.51
Organism:
Homo sapiens (Human)
Description:
P80192
Residue:
1104
  
Inhibitor
Name:
BDBM4814
Synonyms:
CHEMBL535 N-[2-(diethylamino)ethyl]-5-{[(3Z)-5-fluoro-2-oxo-2,3-dihydro-1H-indol-3-ylidene]methyl}-2,4-dimethyl-1H-pyrrole-3-carboxamide SUNITINIB US10464902, Sunitinib US9163010, Sunitinib | US9914707, SU11248
Type:
Small organic molecule
Emp. Form.:
C22H27FN4O2
Mol. Mass.:
398.4738
SMILES:
CCN(CC)CCNC(=O)c1c(C)[nH]c(\C=C2/C(=O)Nc3ccc(F)cc23)c1C
: