Target
Enoyl-acyl carrier reductase ENR
Ligand
BDBM50326320
Substrate
Meas. Tech.
ChEMBL_657369 (CHEMBL1246345)
IC50
174±n/a nM
Citation
 Tipparaju, SKMuench, SPMui, EJRuzheinikov, SNLu, JZHutson, SLKirisits, MJPrigge, STRoberts, CWHenriquez, FLKozikowski, APRice, DWMcLeod, RL Identification and development of novel inhibitors of Toxoplasma gondii enoyl reductase. J Med Chem 53:6287-300 (2010)  
Target
Name:
Enoyl-acyl carrier reductase ENR
Synonyms:
Enoyl-acyl carrier reductase Enoyl-acyl carrier reductase, putative
Type:
PROTEIN
Mol. Mass.:
43663.67
Organism:
Toxoplasma gondii
Description:
ChEMBL_1290812
Residue:
417
  
Inhibitor
Name:
BDBM50326320
Synonyms:
3-(2-Hydroxy-4-propylphenoxy)phenyl Boronic Acid | CHEMBL1240958
Type:
Small organic molecule
Emp. Form.:
C15H17BO4
Mol. Mass.:
272.104
SMILES:
CCCc1ccc(Oc2cccc(c2)B(O)O)c(O)c1
: