Target
Enoyl-acyl carrier reductase ENR
Ligand
BDBM50326323
Substrate
Meas. Tech.
ChEMBL_657369 (CHEMBL1246345)
IC50
280±n/a nM
Citation
 Tipparaju, SKMuench, SPMui, EJRuzheinikov, SNLu, JZHutson, SLKirisits, MJPrigge, STRoberts, CWHenriquez, FLKozikowski, APRice, DWMcLeod, RL Identification and development of novel inhibitors of Toxoplasma gondii enoyl reductase. J Med Chem 53:6287-300 (2010)  
Target
Name:
Enoyl-acyl carrier reductase ENR
Synonyms:
Enoyl-acyl carrier reductase Enoyl-acyl carrier reductase, putative
Type:
PROTEIN
Mol. Mass.:
43663.67
Organism:
Toxoplasma gondii
Description:
ChEMBL_1290812
Residue:
417
  
Inhibitor
Name:
BDBM50326323
Synonyms:
4-(2,6-Dihydroxy-4-propylphenoxy)benzamide | CHEMBL1243121
Type:
Small organic molecule
Emp. Form.:
C16H17NO4
Mol. Mass.:
287.3105
SMILES:
CCCc1cc(O)c(Oc2ccc(cc2)C(N)=O)c(O)c1
: