Target
Enoyl-acyl carrier reductase ENR
Ligand
BDBM50326326
Substrate
Meas. Tech.
ChEMBL_657369 (CHEMBL1246345)
IC50
>20000±n/a nM
Citation
 Tipparaju, SKMuench, SPMui, EJRuzheinikov, SNLu, JZHutson, SLKirisits, MJPrigge, STRoberts, CWHenriquez, FLKozikowski, APRice, DWMcLeod, RL Identification and development of novel inhibitors of Toxoplasma gondii enoyl reductase. J Med Chem 53:6287-300 (2010)  
Target
Name:
Enoyl-acyl carrier reductase ENR
Synonyms:
Enoyl-acyl carrier reductase Enoyl-acyl carrier reductase, putative
Type:
PROTEIN
Mol. Mass.:
43663.67
Organism:
Toxoplasma gondii
Description:
ChEMBL_1290812
Residue:
417
  
Inhibitor
Name:
BDBM50326326
Synonyms:
1-(2-chlorobenzyl)-4-(benzyloxy)pyridin-2(1H)-one CHEMBL260087
Type:
Small organic molecule
Emp. Form.:
C19H16ClNO2
Mol. Mass.:
325.789
SMILES:
Clc1ccccc1Cn1ccc(OCc2ccccc2)cc1=O
: