Target
Enoyl-acyl carrier reductase ENR
Ligand
BDBM50326327
Substrate
Meas. Tech.
ChEMBL_657369 (CHEMBL1246345)
IC50
>20000±n/a nM
Citation
 Tipparaju, SKMuench, SPMui, EJRuzheinikov, SNLu, JZHutson, SLKirisits, MJPrigge, STRoberts, CWHenriquez, FLKozikowski, APRice, DWMcLeod, RL Identification and development of novel inhibitors of Toxoplasma gondii enoyl reductase. J Med Chem 53:6287-300 (2010)  
Target
Name:
Enoyl-acyl carrier reductase ENR
Synonyms:
Enoyl-acyl carrier reductase Enoyl-acyl carrier reductase, putative
Type:
PROTEIN
Mol. Mass.:
43663.67
Organism:
Toxoplasma gondii
Description:
ChEMBL_1290812
Residue:
417
  
Inhibitor
Name:
BDBM50326327
Synonyms:
1-(2-chlorobenzyl)-4-(4-methoxybenzyloxy)pyridin-2(1H)-one | CHEMBL1243243
Type:
Small organic molecule
Emp. Form.:
C20H18ClNO3
Mol. Mass.:
355.815
SMILES:
COc1ccc(COc2ccn(Cc3ccccc3Cl)c(=O)c2)cc1
: