Target
Enoyl-acyl carrier reductase ENR
Ligand
BDBM50326329
Substrate
Meas. Tech.
ChEMBL_657369 (CHEMBL1246345)
IC50
3000±n/a nM
Citation
 Tipparaju, SKMuench, SPMui, EJRuzheinikov, SNLu, JZHutson, SLKirisits, MJPrigge, STRoberts, CWHenriquez, FLKozikowski, APRice, DWMcLeod, RL Identification and development of novel inhibitors of Toxoplasma gondii enoyl reductase. J Med Chem 53:6287-300 (2010)  
Target
Name:
Enoyl-acyl carrier reductase ENR
Synonyms:
Enoyl-acyl carrier reductase Enoyl-acyl carrier reductase, putative
Type:
PROTEIN
Mol. Mass.:
43663.67
Organism:
Toxoplasma gondii
Description:
ChEMBL_1290812
Residue:
417
  
Inhibitor
Name:
BDBM50326329
Synonyms:
5-Chloro-2-(2,4-dichlorophenoxy)phenyl Pivaloate | CHEMBL1243023
Type:
Small organic molecule
Emp. Form.:
C17H15Cl3O3
Mol. Mass.:
373.658
SMILES:
CC(C)(C)C(=O)Oc1cc(Cl)ccc1Oc1ccc(Cl)cc1Cl
: