Target
Enoyl-acyl carrier reductase ENR
Ligand
BDBM50326332
Substrate
Meas. Tech.
ChEMBL_657369 (CHEMBL1246345)
IC50
>20000±n/a nM
Citation
 Tipparaju, SKMuench, SPMui, EJRuzheinikov, SNLu, JZHutson, SLKirisits, MJPrigge, STRoberts, CWHenriquez, FLKozikowski, APRice, DWMcLeod, RL Identification and development of novel inhibitors of Toxoplasma gondii enoyl reductase. J Med Chem 53:6287-300 (2010)  
Target
Name:
Enoyl-acyl carrier reductase ENR
Synonyms:
Enoyl-acyl carrier reductase Enoyl-acyl carrier reductase, putative
Type:
PROTEIN
Mol. Mass.:
43663.67
Organism:
Toxoplasma gondii
Description:
ChEMBL_1290812
Residue:
417
  
Inhibitor
Name:
BDBM50326332
Synonyms:
2-Amino-N-(5-chloro-2-phenoxyphenyl)nicotinamide | CHEMBL1243054
Type:
Small organic molecule
Emp. Form.:
C18H14ClN3O2
Mol. Mass.:
339.776
SMILES:
Nc1ncccc1C(=O)Nc1cc(Cl)ccc1Oc1ccccc1
: