Target
S-methyl-5'-thioadenosine phosphorylase
Ligand
BDBM50326402
Substrate
Meas. Tech.
ChEMBL_657428 (CHEMBL1246404)
Ki
2.1±n/a nM
Citation
 Longshaw, AIAdanitsch, FGutierrez, JAEvans, GBTyler, PCSchramm, VL Design and synthesis of potent"sulfur-free" transition state analogue inhibitors of 5'-methylthioadenosine nucleosidase and 5'-methylthioadenosine phosphorylase. J Med Chem 53:6730-46 (2010)  
Target
Name:
S-methyl-5'-thioadenosine phosphorylase
Synonyms:
5'-Methylthioadenosine phosphorylase (MTAP) MTA phosphorylase MTAP_HUMAN Methylthioadenosine Phosphorylase (MTAP) | S-methyl-5 -thioadenosine phosphorylase
Type:
Enzyme
Mol. Mass.:
31239.23
Organism:
Homo sapiens (Human)
Description:
Residue:
283
  
Inhibitor
Name:
BDBM50326402
Synonyms:
(+/-)-trans-4-Cyclopropyl-1-[(9-deazaadenin-9-yl)methyl]-3-hydroxypyrrolidine | CHEMBL1241380
Type:
Small organic molecule
Emp. Form.:
C14H19N5O
Mol. Mass.:
273.3336
SMILES:
Nc1ncnc2c(CN3C[C@H](O)[C@H](C3)C3CC3)c[nH]c12
: