Target
Polyphenol oxidase 2
Ligand
BDBM50326449
Substrate
Meas. Tech.
ChEMBL_658044 (CHEMBL1248956)
IC50
>2000000±n/a nM
Citation
 Bao, KDai, YZhu, ZBTu, FJZhang, WGYao, XS Design and synthesis of biphenyl derivatives as mushroom tyrosinase inhibitors. Bioorg Med Chem 18:6708-14 (2010)  
Target
Name:
Polyphenol oxidase 2
Synonyms:
Monophenol monooxygenase PPO2 Tyrosinase
Type:
Protein
Mol. Mass.:
63923.66
Organism:
Agaricus bisporus (Common mushroom)
Description:
O42713
Residue:
556
  
Inhibitor
Name:
BDBM50326449
Synonyms:
CHEMBL1243185 | Ethyl 3-hydroxy-3',4',5'-trimethoxybiphenyl-4-carboxylate
Type:
Small organic molecule
Emp. Form.:
C18H20O6
Mol. Mass.:
332.3478
SMILES:
CCOC(=O)c1ccc(cc1O)-c1cc(OC)c(OC)c(OC)c1
: