Target
Polyphenol oxidase 2
Ligand
BDBM50269344
Substrate
Meas. Tech.
ChEMBL_658044 (CHEMBL1248956)
IC50
140000±n/a nM
Citation
 Bao, KDai, YZhu, ZBTu, FJZhang, WGYao, XS Design and synthesis of biphenyl derivatives as mushroom tyrosinase inhibitors. Bioorg Med Chem 18:6708-14 (2010)  
Target
Name:
Polyphenol oxidase 2
Synonyms:
Monophenol monooxygenase PPO2 Tyrosinase
Type:
Protein
Mol. Mass.:
63923.66
Organism:
Agaricus bisporus (Common mushroom)
Description:
O42713
Residue:
556
  
Inhibitor
Name:
BDBM50269344
Synonyms:
3,4'-dihydroxy-3',5'-dimethoxy-(1,1'-biphenyl)-4-O-beta-d-glucoside | CHEMBL498291
Type:
Small organic molecule
Emp. Form.:
C20H24O10
Mol. Mass.:
424.3986
SMILES:
COc1cc(cc(OC)c1O)-c1ccc(O[C@@H]2O[C@H](CO)[C@@H](O)[C@H](O)[C@H]2O)c(O)c1
: