Target
Polyphenol oxidase 2
Ligand
BDBM50326455
Substrate
Meas. Tech.
ChEMBL_658044 (CHEMBL1248956)
IC50
70000±n/a nM
Citation
 Bao, KDai, YZhu, ZBTu, FJZhang, WGYao, XS Design and synthesis of biphenyl derivatives as mushroom tyrosinase inhibitors. Bioorg Med Chem 18:6708-14 (2010)  
Target
Name:
Polyphenol oxidase 2
Synonyms:
Monophenol monooxygenase PPO2 Tyrosinase
Type:
Protein
Mol. Mass.:
63923.66
Organism:
Agaricus bisporus (Common mushroom)
Description:
O42713
Residue:
556
  
Inhibitor
Name:
BDBM50326455
Synonyms:
CHEMBL1243344 | N-Butyl-4'-hydroxy-3',5'-dimethoxybiphenyl-4-carboxamide
Type:
Small organic molecule
Emp. Form.:
C19H23NO4
Mol. Mass.:
329.3902
SMILES:
CCCCNC(=O)c1ccc(cc1)-c1cc(OC)c(O)c(OC)c1
: