Target
Polyphenol oxidase 2
Ligand
BDBM50326457
Substrate
Meas. Tech.
ChEMBL_658044 (CHEMBL1248956)
IC50
170000±n/a nM
Citation
 Bao, KDai, YZhu, ZBTu, FJZhang, WGYao, XS Design and synthesis of biphenyl derivatives as mushroom tyrosinase inhibitors. Bioorg Med Chem 18:6708-14 (2010)  
Target
Name:
Polyphenol oxidase 2
Synonyms:
Monophenol monooxygenase PPO2 Tyrosinase
Type:
Protein
Mol. Mass.:
63923.66
Organism:
Agaricus bisporus (Common mushroom)
Description:
O42713
Residue:
556
  
Inhibitor
Name:
BDBM50326457
Synonyms:
3,5-Dimethoxy-2'-methylbiphenyl-4-ol | CHEMBL1241467
Type:
Small organic molecule
Emp. Form.:
C15H16O3
Mol. Mass.:
244.2857
SMILES:
COc1cc(cc(OC)c1O)-c1ccccc1C
: