Target
Polyphenol oxidase 2
Ligand
BDBM50326458
Substrate
Meas. Tech.
ChEMBL_658044 (CHEMBL1248956)
IC50
90000±n/a nM
Citation
 Bao, KDai, YZhu, ZBTu, FJZhang, WGYao, XS Design and synthesis of biphenyl derivatives as mushroom tyrosinase inhibitors. Bioorg Med Chem 18:6708-14 (2010)  
Target
Name:
Polyphenol oxidase 2
Synonyms:
Monophenol monooxygenase PPO2 Tyrosinase
Type:
Protein
Mol. Mass.:
63923.66
Organism:
Agaricus bisporus (Common mushroom)
Description:
O42713
Residue:
556
  
Inhibitor
Name:
BDBM50326458
Synonyms:
3',5'-Dimethoxybiphenyl-3,4'-diol | CHEMBL1241466
Type:
Small organic molecule
Emp. Form.:
C14H14O4
Mol. Mass.:
246.2586
SMILES:
COc1cc(cc(OC)c1O)-c1cccc(O)c1
: