Target
Polyphenol oxidase 2
Ligand
BDBM50326459
Substrate
Meas. Tech.
ChEMBL_658044 (CHEMBL1248956)
IC50
190000±n/a nM
Citation
 Bao, KDai, YZhu, ZBTu, FJZhang, WGYao, XS Design and synthesis of biphenyl derivatives as mushroom tyrosinase inhibitors. Bioorg Med Chem 18:6708-14 (2010)  
Target
Name:
Polyphenol oxidase 2
Synonyms:
Monophenol monooxygenase PPO2 Tyrosinase
Type:
Protein
Mol. Mass.:
63923.66
Organism:
Agaricus bisporus (Common mushroom)
Description:
O42713
Residue:
556
  
Inhibitor
Name:
BDBM50326459
Synonyms:
5'-(1-Hydroxyethyl)-2',3,5-trimethoxybiphenyl-4-ol | CHEMBL1243343
Type:
Small organic molecule
Emp. Form.:
C17H20O5
Mol. Mass.:
304.3377
SMILES:
COc1cc(cc(OC)c1O)-c1cc(ccc1OC)C(C)O
: