Target
Polyphenol oxidase 2
Ligand
BDBM50326461
Substrate
Meas. Tech.
ChEMBL_658044 (CHEMBL1248956)
IC50
80000±n/a nM
Citation
 Bao, KDai, YZhu, ZBTu, FJZhang, WGYao, XS Design and synthesis of biphenyl derivatives as mushroom tyrosinase inhibitors. Bioorg Med Chem 18:6708-14 (2010)  
Target
Name:
Polyphenol oxidase 2
Synonyms:
Monophenol monooxygenase PPO2 Tyrosinase
Type:
Protein
Mol. Mass.:
63923.66
Organism:
Agaricus bisporus (Common mushroom)
Description:
O42713
Residue:
556
  
Inhibitor
Name:
BDBM50326461
Synonyms:
2-Fluoro-3',5'-dimethoxybiphenyl-3,4'-diol | CHEMBL1241435
Type:
Small organic molecule
Emp. Form.:
C14H13FO4
Mol. Mass.:
264.249
SMILES:
COc1cc(cc(OC)c1O)-c1cccc(O)c1F
: