Target
Polyphenol oxidase 2
Ligand
BDBM50326464
Substrate
Meas. Tech.
ChEMBL_658044 (CHEMBL1248956)
IC50
60000±n/a nM
Citation
 Bao, KDai, YZhu, ZBTu, FJZhang, WGYao, XS Design and synthesis of biphenyl derivatives as mushroom tyrosinase inhibitors. Bioorg Med Chem 18:6708-14 (2010)  
Target
Name:
Polyphenol oxidase 2
Synonyms:
Monophenol monooxygenase PPO2 Tyrosinase
Type:
Protein
Mol. Mass.:
63923.66
Organism:
Agaricus bisporus (Common mushroom)
Description:
O42713
Residue:
556
  
Inhibitor
Name:
BDBM50326464
Synonyms:
2',4'-Difluoro-3,5-dimethoxybiphenyl-4-ol | CHEMBL1241384
Type:
Small organic molecule
Emp. Form.:
C14H12F2O3
Mol. Mass.:
266.2401
SMILES:
COc1cc(cc(OC)c1O)-c1ccc(F)cc1F
: