Target
Polyphenol oxidase 2
Ligand
BDBM50326467
Substrate
Meas. Tech.
ChEMBL_658044 (CHEMBL1248956)
IC50
30000±n/a nM
Citation
 Bao, KDai, YZhu, ZBTu, FJZhang, WGYao, XS Design and synthesis of biphenyl derivatives as mushroom tyrosinase inhibitors. Bioorg Med Chem 18:6708-14 (2010)  
Target
Name:
Polyphenol oxidase 2
Synonyms:
Monophenol monooxygenase PPO2 Tyrosinase
Type:
Protein
Mol. Mass.:
63923.66
Organism:
Agaricus bisporus (Common mushroom)
Description:
O42713
Residue:
556
  
Inhibitor
Name:
BDBM50326467
Synonyms:
CHEMBL1243315 | N-Benzyl-3,4'-dihydroxy-3',5'-dimethoxybiphenyl-4-carboxamide
Type:
Small organic molecule
Emp. Form.:
C22H21NO5
Mol. Mass.:
379.4058
SMILES:
COc1cc(cc(OC)c1O)-c1ccc(C(=O)NCc2ccccc2)c(O)c1
: