Target
Polyphenol oxidase 2
Ligand
BDBM50326468
Substrate
Meas. Tech.
ChEMBL_658044 (CHEMBL1248956)
IC50
50000±n/a nM
Citation
 Bao, KDai, YZhu, ZBTu, FJZhang, WGYao, XS Design and synthesis of biphenyl derivatives as mushroom tyrosinase inhibitors. Bioorg Med Chem 18:6708-14 (2010)  
Target
Name:
Polyphenol oxidase 2
Synonyms:
Monophenol monooxygenase PPO2 Tyrosinase
Type:
Protein
Mol. Mass.:
63923.66
Organism:
Agaricus bisporus (Common mushroom)
Description:
O42713
Residue:
556
  
Inhibitor
Name:
BDBM50326468
Synonyms:
CHEMBL1243314 | Ethyl 3,4'-dihydroxy-3',5'-dimethoxybiphenyl-4-carboxylate
Type:
Small organic molecule
Emp. Form.:
C17H18O6
Mol. Mass.:
318.3212
SMILES:
CCOC(=O)c1ccc(cc1O)-c1cc(OC)c(O)c(OC)c1
: