Target
Polyphenol oxidase 2
Ligand
BDBM50326470
Substrate
Meas. Tech.
ChEMBL_658044 (CHEMBL1248956)
IC50
60000±n/a nM
Citation
 Bao, KDai, YZhu, ZBTu, FJZhang, WGYao, XS Design and synthesis of biphenyl derivatives as mushroom tyrosinase inhibitors. Bioorg Med Chem 18:6708-14 (2010)  
Target
Name:
Polyphenol oxidase 2
Synonyms:
Monophenol monooxygenase PPO2 Tyrosinase
Type:
Protein
Mol. Mass.:
63923.66
Organism:
Agaricus bisporus (Common mushroom)
Description:
O42713
Residue:
556
  
Inhibitor
Name:
BDBM50326470
Synonyms:
3,4'-Dihydroxy-3',5'-dimethoxybiphenyl-4-carbaldehyde | CHEMBL1241352
Type:
Small organic molecule
Emp. Form.:
C15H14O5
Mol. Mass.:
274.2687
SMILES:
COc1cc(cc(OC)c1O)-c1ccc(C=O)c(O)c1
: