Target
Polyphenol oxidase 2
Ligand
BDBM50326474
Substrate
Meas. Tech.
ChEMBL_658044 (CHEMBL1248956)
IC50
>2000000±n/a nM
Citation
 Bao, KDai, YZhu, ZBTu, FJZhang, WGYao, XS Design and synthesis of biphenyl derivatives as mushroom tyrosinase inhibitors. Bioorg Med Chem 18:6708-14 (2010)  
Target
Name:
Polyphenol oxidase 2
Synonyms:
Monophenol monooxygenase PPO2 Tyrosinase
Type:
Protein
Mol. Mass.:
63923.66
Organism:
Agaricus bisporus (Common mushroom)
Description:
O42713
Residue:
556
  
Inhibitor
Name:
BDBM50326474
Synonyms:
3',4',5'-Trimethoxybiphenyl-4-carboxylic acid | CHEMBL1243252
Type:
Small organic molecule
Emp. Form.:
C16H16O5
Mol. Mass.:
288.2952
SMILES:
COc1cc(cc(OC)c1OC)-c1ccc(cc1)C(O)=O
: