Target
Polyphenol oxidase 2
Ligand
BDBM50326475
Substrate
Meas. Tech.
ChEMBL_658044 (CHEMBL1248956)
IC50
>2000000±n/a nM
Citation
 Bao, KDai, YZhu, ZBTu, FJZhang, WGYao, XS Design and synthesis of biphenyl derivatives as mushroom tyrosinase inhibitors. Bioorg Med Chem 18:6708-14 (2010)  
Target
Name:
Polyphenol oxidase 2
Synonyms:
Monophenol monooxygenase PPO2 Tyrosinase
Type:
Protein
Mol. Mass.:
63923.66
Organism:
Agaricus bisporus (Common mushroom)
Description:
O42713
Residue:
556
  
Inhibitor
Name:
BDBM50326475
Synonyms:
3',4',5'-Trimethoxy-2-methylbiphenyl | CHEMBL1241351
Type:
Small organic molecule
Emp. Form.:
C16H18O3
Mol. Mass.:
258.3123
SMILES:
COc1cc(cc(OC)c1OC)-c1ccccc1C
: