Target
Polyphenol oxidase 2
Ligand
BDBM50326476
Substrate
Meas. Tech.
ChEMBL_658044 (CHEMBL1248956)
IC50
550000±n/a nM
Citation
 Bao, KDai, YZhu, ZBTu, FJZhang, WGYao, XS Design and synthesis of biphenyl derivatives as mushroom tyrosinase inhibitors. Bioorg Med Chem 18:6708-14 (2010)  
Target
Name:
Polyphenol oxidase 2
Synonyms:
Monophenol monooxygenase PPO2 Tyrosinase
Type:
Protein
Mol. Mass.:
63923.66
Organism:
Agaricus bisporus (Common mushroom)
Description:
O42713
Residue:
556
  
Inhibitor
Name:
BDBM50326476
Synonyms:
3'-(Benzyloxy)-3,4,5-trimethoxybiphenyl | CHEMBL1243251
Type:
Small organic molecule
Emp. Form.:
C22H22O4
Mol. Mass.:
350.4077
SMILES:
COc1cc(cc(OC)c1OC)-c1cccc(OCc2ccccc2)c1
: