Target
Polyphenol oxidase 2
Ligand
BDBM50326456
Substrate
Meas. Tech.
ChEMBL_658045 (CHEMBL1248957)
Ki
38000±n/a nM
Citation
 Bao, KDai, YZhu, ZBTu, FJZhang, WGYao, XS Design and synthesis of biphenyl derivatives as mushroom tyrosinase inhibitors. Bioorg Med Chem 18:6708-14 (2010)  
Target
Name:
Polyphenol oxidase 2
Synonyms:
Monophenol monooxygenase PPO2 Tyrosinase
Type:
Protein
Mol. Mass.:
63923.66
Organism:
Agaricus bisporus (Common mushroom)
Description:
O42713
Residue:
556
  
Inhibitor
Name:
BDBM50326456
Synonyms:
4'-Hydroxy-3',5'-dimethoxybiphenyl-4-carboxylic acid | CHEMBL1241468
Type:
Small organic molecule
Emp. Form.:
C15H14O5
Mol. Mass.:
274.2687
SMILES:
COc1cc(cc(OC)c1O)-c1ccc(cc1)C(O)=O
: