Target
Oxytocin receptor
Ligand
BDBM50372611
Substrate
Meas. Tech.
ChEMBL_661588 (CHEMBL1251522)
Ki
1.26±n/a nM
Citation
 Borthwick, AD Oral oxytocin antagonists. J Med Chem 53:6525-38 (2010)  
Target
Name:
Oxytocin receptor
Synonyms:
OT-R OXYR_HUMAN | Oxytocin
Type:
Enzyme Catalytic Domain
Mol. Mass.:
42793.26
Organism:
Homo sapiens (Human)
Description:
Oxytocin OXTR HEK293::B2R9L7
Residue:
389
  
Inhibitor
Name:
BDBM50372611
Synonyms:
CHEMBL196478
Type:
Small organic molecule
Emp. Form.:
C28H33F2N3O3
Mol. Mass.:
497.5767
SMILES:
CC(C)C[C@H]1N([C@@H](C(=O)NC(C)C)c2ccc(F)cc2F)C(=O)[C@H](NC1=O)C1Cc2ccccc2C1
: