Target
Sarcoplasmic/endoplasmic reticulum calcium ATPase 1
Ligand
BDBM50326753
Substrate
Meas. Tech.
ChEMBL_661606 (CHEMBL1251540)
IC50
>70±n/a nM
Citation
 Skytte, DMMøller, JVLiu, HNielsen, HØSvenningsen, LEJensen, CMOlsen, CEChristensen, SB Elucidation of the topography of the thapsigargin binding site in the sarco-endoplasmic calcium ATPase. Bioorg Med Chem 18:5634-46 (2010)  
Target
Name:
Sarcoplasmic/endoplasmic reticulum calcium ATPase 1
Synonyms:
AT2A1_RABIT Sarco/endoplasmic Reticulum Ca2+ ATPase 1 | Sarcoplasmic/endoplasmic reticulum calcium ATP-ase
Type:
PROTEIN
Mol. Mass.:
110435.34
Organism:
Oryctolagus cuniculus
Description:
ChEMBL_1500621
Residue:
1001
  
Inhibitor
Name:
BDBM50326753
Synonyms:
(3S,3aR,4S,6S,6aR,7S,8S,9bS)-6-acetoxy-4-(butyryloxy)-3,3a-dihydroxy-3,6,9-trimethyl-7-(octanoyloxy)-2-oxo-2,3,3a,4,5,6,6a,7,8,9b-decahydroazuleno[4,5-b]furan-8-yl biphenyl-4-carboxylate | CHEMBL1253596
Type:
Small organic molecule
Emp. Form.:
C42H52O12
Mol. Mass.:
748.8551
SMILES:
CCCCCCCC(=O)O[C@@H]1[C@@H](OC(=O)c2ccc(cc2)-c2ccccc2)C(C)=C2[C@@H]3OC(=O)[C@@](C)(O)[C@@]3(O)[C@H](C[C@](C)(OC(C)=O)[C@@H]12)OC(=O)CCC
: