Target
Ecdysone receptor
Ligand
BDBM50326767
Substrate
Meas. Tech.
ChEMBL_661762 (CHEMBL1251995)
IC50
5500±n/a nM
Citation
 Birru, WFernley, RTGraham, LDGrusovin, JHill, RJHofmann, AHowell, LJames, PJJarvis, KEJohnson, WMJones, DALeitner, CLiepa, AJLovrecz, GOLu, LNearn, RHO'Driscoll, BJPhan, TPollard, MTurner, KAWinkler, DA Synthesis, binding and bioactivity of gamma-methylene gamma-lactam ecdysone receptor ligands: advantages of QSAR models for flexible receptors. Bioorg Med Chem 18:5647-60 (2010)  
Target
Name:
Ecdysone receptor
Synonyms:
20-hydroxy-ecdysone receptor ECR_LUCCU EcRH NR1H1 | Nuclear receptor subfamily 1 group H member 1
Type:
PROTEIN
Mol. Mass.:
82587.92
Organism:
Lucilia cuprina
Description:
ChEMBL_661762
Residue:
757
  
Inhibitor
Name:
BDBM50326767
Synonyms:
4-butyl-1-(2-tert-butyl-5-chlorophenyl)-5-methylene-2-oxo-2,5-dihydro-1H-pyrrole-3-carbonitrile | CHEMBL1254948
Type:
Small organic molecule
Emp. Form.:
C20H23ClN2O
Mol. Mass.:
342.862
SMILES:
CCCCC1=C(C#N)C(=O)N(C1=C)c1cc(Cl)ccc1C(C)(C)C
: