Target
Vascular endothelial growth factor receptor 2
Ligand
BDBM50327066
Substrate
Meas. Tech.
ChEMBL_663741 (CHEMBL1250641)
IC50
110±n/a nM
Citation
 Oguro, YMiyamoto, NOkada, KTakagi, TIwata, HAwazu, YMiki, HHori, AKamiyama, KImamura, S Design, synthesis, and evaluation of 5-methyl-4-phenoxy-5H-pyrrolo[3,2-d]pyrimidine derivatives: novel VEGFR2 kinase inhibitors binding to inactive kinase conformation. Bioorg Med Chem 18:7260-73 (2010)  
Target
Name:
Vascular endothelial growth factor receptor 2
Synonyms:
CD_antigen=CD309 Fetal liver kinase 1 (FLK-1) KDR Protein-tyrosine kinase receptor Flk-1 VEGFR-2 VEGFR2 Vascular Endothelial Growth Factor Receptor Kinase 2 Vascular endothelial growth factor receptor 2 (KDR) Vascular endothelial growth factor receptor 2 (VEGFR2) Vascular endothelial growth factor receptor-2 (VEGFR-2)
Type:
Receptor Tyrosine Kinase
Mol. Mass.:
151510.97
Organism:
Homo sapiens (Human)
Description:
P35968
Residue:
1356
  
Inhibitor
Name:
BDBM50327066
Synonyms:
1-{4-[(5-Methyl-5H-pyrrolo[3,2-d]pyrimidin-4-yl)sulfanyl]-phenyl}-3-phenylurea | CHEMBL1254002
Type:
Small organic molecule
Emp. Form.:
C20H17N5OS
Mol. Mass.:
375.447
SMILES:
Cn1ccc2ncnc(Sc3ccc(NC(=O)Nc4ccccc4)cc3)c12
: